{"text_format":"1","workbook":"xlsx","n_sheets":9,"sheets":["CST_Urbano","CST_Estrada","FCT_Urbano_Dados","Emissões 6.2.2.1 Urbano","Emissões 6.2.2.2 Urbano","FCT_Estrada_Dados","Emissões 6.2.2.1 Estrada","Emissões 6.2.2.2 Estrada","Sumário & Médias"],"not_rendered":{"charts":0,"images":1,"macros":1,"external_links":0,"defined_names":3,"comments":0,"pivot_tables":0},"unopened":[],"bounds":{"document_bytes":16777216,"sheet_cells":100000,"rows_first":2000,"rows_last":500,"rows_between":2000,"halvings":0,"cell_chars":16384,"cell_head_chars":4096},"cells_cut":0,"cells_raw":0,"read":"whole","date_system":"1900"}

{"sheet":"CST_Urbano","index":0,"n_rows":29,"n_cols":14,"rows_kept":29,"cut":false,"hidden":false,"merged":[[6,6,6,7],[0,1,0,13],[1,1,1,13],[2,1,2,13],[8,1,8,13],[21,0,21,2],[14,1,14,10],[19,0,19,1],[3,0,3,13],[4,0,4,1],[5,0,5,1],[4,2,4,3],[5,2,5,3],[6,2,6,3],[6,0,6,1],[4,4,4,5],[5,4,5,5],[6,4,6,5],[4,6,4,7],[5,6,5,7]]}
[null,"Cálculos de veículos híbridos"]
[null,"Ensaio em carga sustentada no ciclo urbano"]
[null,"    Versão 8"]
["Dados do veículo e do ensaio"]
["id do veículo",null,null,null,"Capacidade do RESS",null,null,null,"Ah"]
["nº do processo",null,null,null,"Vsist1",null,null,null,"V"]
["Combustível do ensaio",null,null,null,"Vsist2",null,null,null,"V"]
[]
[null,"Emissões mássicas e informações dos ciclos"]
[null,"Y(g/ciclo)","Y(g/ciclo)","Y(g/ciclo)","Y(g/ciclo)","Y(g/ciclo)","Y(g/ciclo)","Y(g/ciclo)","Y(g/ciclo)","Y(g/ciclo)","Consumo","D","ΔSOC1","ΔSOC2"]
[null,"CO","HC","NOx","CO2","CH4","NMHC","NMOG","Aldeídos","M.P.","(l/100km)","(km)","(Ah)","(Ah)"]
["CCU1",null,null,null,null,null,null,null,null,null,{"$f":"IFERROR(IF($C$7=\"Diesel\",((0.8656*C12/L12)+(0.4288*B12/L12)+(0.2729*E12/L12))*(0.1155/0.83),((0.8656*C12/L12)+(0.4288*B12/L12)+(0.2729*E12/L12))*(100/((6.4487*VLOOKUP($C$7,Combustíveis,4,FALSE))+(4.1102*VLOOKUP($C$7,Combustíveis,3,FALSE))))),\"\")","v":""}]
["CCU2",null,null,null,null,null,null,null,null,null,{"$f":"IFERROR(IF($C$7=\"Diesel\",((0.8656*C13/L13)+(0.4288*B13/L13)+(0.2729*E13/L13))*(0.1155/0.83),((0.8656*C13/L13)+(0.4288*B13/L13)+(0.2729*E13/L13))*(100/((6.4487*VLOOKUP($C$7,Combustíveis,4,FALSE))+(4.1102*VLOOKUP($C$7,Combustíveis,3,FALSE))))),\"\")","v":""}]
[]
[null,"Resultado das emissões"]
{"$rows_left_out":15}
{"sheet":"CST_Estrada","index":1,"n_rows":29,"n_cols":11,"rows_kept":29,"cut":false,"hidden":false,"merged":[[21,0,21,2],[6,4,6,5],[6,6,6,7],[13,1,13,6],[8,1,8,10],[18,0,18,1],[19,0,19,1],[0,1,0,13],[1,1,1,13],[2,1,2,13],[3,0,3,13],[4,0,4,1],[4,2,4,3],[4,4,4,5],[4,6,4,7],[5,0,5,1],[5,2,5,3],[5,4,5,5],[5,6,5,7],[6,0,6,1],[6,2,6,3]]}
[null,"Cálculos de veículos híbridos"]
[null,"Ensaio em carga sustentada no ciclo estrada"]
[null,"    Versão 8"]
["Dados do veículo e do ensaio"]
["id do veículo",null,{"$f":"IF(ISBLANK(CST_Urbano!C5),\"\",CST_Urbano!C5)","v":""},null,"Capacidade do RESS",null,{"$f":"IF(ISBLANK(CST_Urbano!G5),\"\",CST_Urbano!G5)","v":""},null,"Ah"]
["nº do processo",null,{"$f":"IF(ISBLANK(CST_Urbano!C6),\"\",CST_Urbano!C6)","v":""},null,"Vsist1",null,{"$f":"IF(ISBLANK(CST_Urbano!G6),\"\",CST_Urbano!G6)","v":""},null,"V"]
["Combustível do ensaio",null,{"$f":"IF(ISBLANK(CST_Urbano!C7),\"\",CST_Urbano!C7)","v":""},null,"Vsist2",null,{"$f":"IF(ISBLANK(CST_Urbano!G7),\"\",CST_Urbano!G7)","v":""},null,"V"]
[]
[null,"Emissões mássicas e informações do ciclo"]
[null,"Y(g/ciclo)","Y(g/ciclo)","Y(g/ciclo)","Y(g/ciclo)","Y(g/ciclo)","Y(g/ciclo)","D","Consumo","ΔSOC1","ΔSOC2"]
[null,"CO","HC","NOx","CO2","CH4","NMHC","(km)","(l/100km)","(Ah)","(Ah)"]
["CCE2",null,null,null,null,null,null,null,{"$f":"IFERROR(IF($C$7=\"Diesel\",((0.8656*$C$12/H12)+(0.4288*$B$12/H12)+(0.2729*$E$12/H12))*(0.1155/0.83),((0.8656*$C$12/H12)+(0.4288*$B$12/H12)+(0.2729*$E$12/H12))*(100/((6.4487*VLOOKUP($C$7,Combustíveis,4,FALSE))+(4.1102*VLOOKUP($C$7,Combustíveis,3,FALSE))))),\"\")","v":""}]
[]
[null,"Resultado das emissões"]
[null,"CO","HC","NOx","CO2","CH4","NMHC"]
{"$rows_left_out":15}
{"sheet":"FCT_Urbano_Dados","index":2,"n_rows":71,"n_cols":19,"rows_kept":71,"cut":false,"hidden":false,"merged":[[0,1,0,18],[1,1,1,18],[8,0,8,13],[9,0,9,1],[9,9,9,10],[9,6,9,7],[9,11,9,12],[9,2,9,4],[4,0,4,1],[4,2,4,3],[4,4,4,5],[4,6,4,7],[6,0,6,1],[6,2,6,3],[6,4,6,5],[6,6,6,7],[14,14,14,18],[12,4,12,5],[12,9,12,10],[12,6,12,7],[12,11,12,12],[12,14,12,18],[14,0,14,13],[11,0,11,18],[2,1,2,13],[2,14,2,18],[5,0,5,1],[5,2,5,3],[5,4,5,5],[5,6,5,7],[3,0,3,18]]}
[null,"Cálculos de veículos híbridos"]
[null,"Dados dos ensaios em redução de carga no ciclo urbano"]
[null,"    Versão 8"]
["Dados do veículo e do ensaio"]
["id do veículo",null,{"$f":"IF(ISBLANK(CST_Urbano!C5),\"\",CST_Urbano!C5)","v":""},null,"Capacidade do RESS",null,{"$f":"IF(ISBLANK(CST_Urbano!G5),\"\",CST_Urbano!G5)","v":""},null,"Ah"]
["nº do processo",null,{"$f":"IF(ISBLANK(CST_Urbano!C6),\"\",CST_Urbano!C6)","v":""},null,"Vsist1",null,{"$f":"IF(ISBLANK(CST_Urbano!G6),\"\",CST_Urbano!G6)","v":""},null,"V"]
["Combustível do ensaio",null,{"$f":"IF(ISBLANK(CST_Urbano!C7),\"\",CST_Urbano!C7)","v":""},null,"Vsist2",null,{"$f":"IF(ISBLANK(CST_Urbano!G7),\"\",CST_Urbano!G7)","v":""},null,"V"]
[]
["Dados Complementares do FCT"]
["Critério EOT",null,null,null,null,"EAC total",null,null,"Wh","AER",null,null,null,"km"]
[]
["Cálculos intermediários no regime de redução de carga"]
["n",{"$f":"SUMIF(S18:S71,\"n\",A18:A71)","v":0},"Zn",null,"RCDC:",null,null,null,"km","RCDA:",null,null,null,"km"]
[]
["Dados de emissão mássica, distâncias e balanço de carga do FCT urbano",null,null,null,null,null,null,null,null,null,null,null,null,null,"Verificação de EOT"]
{"$rows_left_out":57}
{"sheet":"Emissões 6.2.2.1 Urbano","index":3,"n_rows":70,"n_cols":17,"rows_kept":70,"cut":false,"hidden":false,"merged":[[13,0,13,13],[5,0,5,1],[5,2,5,3],[5,4,5,5],[5,6,5,7],[6,0,6,1],[6,2,6,3],[6,4,6,5],[6,6,6,7],[8,1,8,9],[0,1,0,13],[1,1,1,13],[2,1,2,13],[3,0,3,13],[4,0,4,1],[4,2,4,3],[4,4,4,5],[4,6,4,7]]}
[null,"Cálculos de veículos híbridos"]
[null,"Ensaios em redução de carga no ciclo urbano - Resultados conforme 6.2.2.1"]
[null,"    Versão 8"]
["Dados do veículo e do ensaio"]
["id do veículo",null,{"$f":"IF(ISBLANK(CST_Urbano!C5),\"\",CST_Urbano!C5)","v":""},null,"Capacidade do RESS",null,{"$f":"IF(ISBLANK(CST_Urbano!G5),\"\",CST_Urbano!G5)","v":""},null,"Ah"]
["nº do processo",null,{"$f":"IF(ISBLANK(CST_Urbano!C6),\"\",CST_Urbano!C6)","v":""},null,"Vsist1",null,{"$f":"IF(ISBLANK(CST_Urbano!G6),\"\",CST_Urbano!G6)","v":""},null,"V"]
["Combustível do ensaio",null,{"$f":"IF(ISBLANK(CST_Urbano!C7),\"\",CST_Urbano!C7)","v":""},null,"Vsist2",null,{"$f":"IF(ISBLANK(CST_Urbano!G7),\"\",CST_Urbano!G7)","v":""},null,"V"]
[]
[null,"Resultado das emissões e consumo energético conforme item 6.2.2.1"]
[null,"CO","HC","NOx","CO2","NMHC","ECCD","FCCD","ACequiv.","Consumotot."]
[null,"(g/km)","(g/km)","(g/km)","(g/km)","(g/km)","(Wh/km)","(l/100km)","(l/100km)","(l/100km)"]
[null,{"$f":"IFERROR((SUMIFS(FCT_Urbano_Dados!$B$18:$B$71,FCT_Urbano_Dados!$S$18:$S$71,\"CD\")+(1+FCT_Urbano_Dados!$D$13)*SUMIFS(FCT_Urbano_Dados!$B$18:$B$71,FCT_Urbano_Dados!$S$18:$S$71,\"n-1\"))/FCT_Urbano_Dados!$L$13,\"\")","v":""},{"$f":"IFERROR((SUMIFS(FCT_Urbano_Dados!$C$18:$C$71,FCT_Urbano_Dados!$S$18:$S$71,\"CD\")+(1+FCT_Urbano_Dados!$D$13)*SUMIFS(FCT_Urbano_Dados!$C$18:$C$71,FCT_Urbano_Dados!$S$18:$S$71,\"n-1\"))/FCT_Urbano_Dados!$L$13,\"\")","v":""},{"$f":"IFERROR((SUMIFS(FCT_Urbano_Dados!$D$18:$D$71,FCT_Urbano_Dados!$S$18:$S$71,\"CD\")+(1+FCT_Urbano_Dados!$D$13)*SUMIFS(FCT_Urbano_Dados!$D$18:$D$71,FCT_Urbano_Dados!$S$18:$S$71,\"n-1\"))/FCT_Urbano_Dados!$L$13,\"\")","v":""},{"$f":"IFERROR((SUMIFS(FCT_Urbano_Dados!$E$18:$E$71,FCT_Urbano_Dados!$S$18:$S$71,\"CD\")+(1+FCT_Urbano_Dados!$D$13)*SUMIFS(FCT_Urbano_Dados!$E$18:$E$71,FCT_Urbano_Dados!$S$18:$S$71,\"n-1\"))/FCT_Urbano_Dados!$L$13,\"\")","v":""},{"$f":"IFERROR((SUMIFS(FCT_Urbano_Dados!$G$18:$G$71,FCT_Urbano_Dados!$S$18:$S$71,\"CD\")+(1+FCT_Urbano_Dados!$D$13)*SUMIFS(FCT_Urbano_Dados!$G$18:$G$71,FCT_Urbano_Dados!$S$18:$S$71,\"n-1\"))/FCT_Urbano_Dados!$L$13,\"\")","v":""},{"$f":"IFERROR(FCT_Urbano_Dados!$G$10/FCT_Urbano_Dados!$L$13,\"\")","v":""},{"$f":"IFERROR(SUM(IF(FCT_Urbano_Dados!S18:S71=\"CD\",FCT_Urbano_Dados!H18:H71*FCT_Urbano_Dados!P18:P71,0)+(1+FCT_Urbano_Dados!D13)*IF(FCT_Urbano_Dados!S18:S71=\"n-1\",FCT_Urbano_Dados!H18:H71*FCT_Urbano_Dados!P18:P71,0))/FCT_Urbano_Dados!L13,\"\")","v":""},{"$f":"IFERROR(100*((G12*0.0036)/VLOOKUP(CST_Urbano!C7,Combustíveis,2,FALSE)),\"\")","v":""},{"$f":"IFERROR(H12+I12,\"\")","v":""}]
[]
["Resultado das emissões e consumo energético por ciclo"]
["Nº Ciclo","CO","HC","NOx","CO2","NMHC","ECDi","EDCi","DC/AC","Consumo_AC","Consumo_DC","AC equivalente","Consumo","Tipo de"]
{"$rows_left_out":56}
{"sheet":"Emissões 6.2.2.2 Urbano","index":4,"n_rows":70,"n_cols":14,"rows_kept":70,"cut":false,"hidden":false,"merged":[[5,0,5,1],[5,2,5,3],[5,4,5,5],[5,6,5,7],[0,1,0,13],[1,1,1,13],[2,1,2,13],[3,0,3,13],[4,0,4,1],[4,2,4,3],[4,4,4,5],[4,6,4,7],[6,0,6,1],[6,2,6,3],[6,4,6,5],[6,6,6,7],[13,0,13,13],[8,1,8,9]]}
[null,"Cálculos de veículos híbridos"]
[null,"Ensaios em redução de carga no ciclo urbano - Resultados conforme 6.2.2.2"]
[null,"    Versão 8"]
["Dados do veículo e do ensaio"]
["id do veículo",null,{"$f":"IF(ISBLANK(CST_Urbano!C5),\"\",CST_Urbano!C5)","v":""},null,"Capacidade do RESS",null,{"$f":"IF(ISBLANK(CST_Urbano!G5),\"\",CST_Urbano!G5)","v":""},null,"Ah"]
["nº do processo",null,{"$f":"IF(ISBLANK(CST_Urbano!C6),\"\",CST_Urbano!C6)","v":""},null,"Vsist1",null,{"$f":"IF(ISBLANK(CST_Urbano!G6),\"\",CST_Urbano!G6)","v":""},null,"V"]
["Combustível do ensaio",null,{"$f":"IF(ISBLANK(CST_Urbano!C7),\"\",CST_Urbano!C7)","v":""},null,"Vsist2",null,{"$f":"IF(ISBLANK(CST_Urbano!G7),\"\",CST_Urbano!G7)","v":""},null,"V"]
[]
[null,"Resultado das emissões e consumo energético conforme item 6.2.2.2"]
[null,"CO","HC","NOx","CO2","NMHC","ECCD","FCCD","ACequiv.","Consumotot."]
[null,"(g/km)","(g/km)","(g/km)","(g/km)","(g/km)","(Wh/km)","(l/100km)","(l/100km)","(l/100km)"]
[null,{"$f":"IF(COUNTIF($N$17:$N$70,\"Início EOT\")+COUNTIF($N$17:$N$70,\"CS1\")>0,SUMIF($N$17:$N$70,\"CD\",$B$17:$B$70)+SUMIF($N$17:$N$70,\"n-1\",$B$17:$B$70)+SUMIF($N$17:$N$70,\"n\",$B$17:$B$70)+SUMIF($N$17:$N$70,\"Transição\",$B$17:$B$70)+CST_Urbano!$B$18*(1-UTILITYFACTOR(FCT_Urbano_Dados!$G$13)),\"\")","v":""},{"$f":"IF(COUNTIF($N$17:$N$70,\"Início EOT\")+COUNTIF($N$17:$N$70,\"CS1\")>0,SUMIF($N$17:$N$70,\"CD\",$C$17:$C$70)+SUMIF($N$17:$N$70,\"n-1\",$C$17:$C$70)+SUMIF($N$17:$N$70,\"n\",$C$17:$C$70)+SUMIF($N$17:$N$70,\"Transição\",$C$17:$C$70)+CST_Urbano!$C$18*(1-UTILITYFACTOR(FCT_Urbano_Dados!$G$13)),\"\")","v":""},{"$f":"IF(COUNTIF($N$17:$N$70,\"Início EOT\")+COUNTIF($N$17:$N$70,\"CS1\")>0,SUMIF($N$17:$N$70,\"CD\",$D$17:$D$70)+SUMIF($N$17:$N$70,\"n-1\",$D$17:$D$70)+SUMIF($N$17:$N$70,\"n\",$D$17:$D$70)+SUMIF($N$17:$N$70,\"Transição\",$D$17:$D$70)+CST_Urbano!$D$18*(1-UTILITYFACTOR(FCT_Urbano_Dados!$G$13)),\"\")","v":""},{"$f":"IF(COUNTIF($N$17:$N$70,\"Início EOT\")+COUNTIF($N$17:$N$70,\"CS1\")>0,SUMIF($N$17:$N$70,\"CD\",$E$17:$E$70)+SUMIF($N$17:$N$70,\"n-1\",$E$17:$E$70)+SUMIF($N$17:$N$70,\"n\",$E$17:$E$70)+SUMIF($N$17:$N$70,\"Transição\",$E$17:$E$70)+CST_Urbano!$E$18*(1-UTILITYFACTOR(FCT_Urbano_Dados!$G$13)),\"\")","v":""},{"$f":"IF(COUNTIF($N$17:$N$70,\"Início EOT\")+COUNTIF($N$17:$N$70,\"CS1\")>0,SUMIF($N$17:$N$70,\"CD\",$F$17:$F$70)+SUMIF($N$17:$N$70,\"n-1\",$F$17:$F$70)+SUMIF($N$17:$N$70,\"n\",$F$17:$F$70)+SUMIF($N$17:$N$70,\"Transição\",$F$17:$F$70)+CST_Urbano!$G$18*(1-UTILITYFACTOR(FCT_Urbano_Dados!$G$13)),\"\")","v":""},{"$f":"IF(COUNTIF($N$17:$N$70,\"Início EOT\")+COUNTIF($N$17:$N$70,\"CS1\")>0,SUMIF($N$17:$N$70,\"CD\",$J$17:$J$70)+SUMIF($N$17:$N$70,\"n-1\",$J$17:$J$70)+SUMIF($N$17:$N$70,\"n\",$J$17:$J$70)+SUMIF($N$17:$N$70,\"Transição\",$J$17:$J$70),\"\")","v":""},{"$f":"IF(COUNTIF($N$17:$N$70,\"Início EOT\")+COUNTIF($N$17:$N$70,\"CS1\")>0,SUMIF($N$17:$N$70,\"CD\",$M$17:$M$70)+SUMIF($N$17:$N$70,\"n-1\",$M$17:$M$70)+SUMIF($N$17:$N$70,\"n\",$M$17:$M$70)+SUMIF($N$17:$N$70,\"Transição\",$M$17:$M$70)+CST_Urbano!$K$18*(1-UTILITYFACTOR(FCT_Urbano_Dados!$G$13)),\"\")","v":""},{"$f":"IFERROR(100*((G12*0.0036)/VLOOKUP(CST_Urbano!$C$7,Combustíveis,2,FALSE)),\"\")","v":""},{"$f":"IFERROR(H12+I12,\"\")","v":""}]
[]
["EMISSÕES E CONSUMOS PONDERADOS COM FATORES DE UTILIZAÇÃO PARA CADA CICLO"]
["Nº Ciclo","CO","HC","NOx","CO2","NMHC","ECDi","EDCi","UFi","Consumo_AC","Consumo_DC","AC equivalente","Consumo","Tipo de"]
{"$rows_left_out":56}
{"sheet":"FCT_Estrada_Dados","index":5,"n_rows":71,"n_cols":19,"rows_kept":71,"cut":false,"hidden":false,"merged":[[0,1,0,18],[1,1,1,18],[2,1,2,18],[3,0,3,18],[4,0,4,1],[4,2,4,3],[4,4,4,5],[4,6,4,7],[5,0,5,1],[5,2,5,3],[5,4,5,5],[5,6,5,7],[6,0,6,1],[6,2,6,3],[6,4,6,5],[6,6,6,7],[8,0,8,13],[9,0,9,1],[9,2,9,4],[9,6,9,7],[9,9,9,10],[9,11,9,12],[14,0,14,13],[14,14,14,18],[11,0,11,18],[12,4,12,5],[12,6,12,7],[12,9,12,10],[12,11,12,12],[12,14,12,18]]}
[null,"Cálculos de veículos híbridos"]
[null,"Dados dos ensaios em redução de carga no ciclo estrada"]
[null,"    Versão 8"]
["Dados do veículo e do ensaio"]
["id do veículo",null,{"$f":"IF(ISBLANK(CST_Urbano!C5),\"\",CST_Urbano!C5)","v":""},null,"Capacidade do RESS",null,{"$f":"IF(ISBLANK(CST_Urbano!G5),\"\",CST_Urbano!G5)","v":""},null,"Ah"]
["nº do processo",null,{"$f":"IF(ISBLANK(CST_Urbano!C6),\"\",CST_Urbano!C6)","v":""},null,"Vsist1",null,{"$f":"IF(ISBLANK(CST_Urbano!G6),\"\",CST_Urbano!G6)","v":""},null,"V"]
["Combustível do ensaio",null,{"$f":"IF(ISBLANK(CST_Urbano!C7),\"\",CST_Urbano!C7)","v":""},null,"Vsist2",null,{"$f":"IF(ISBLANK(CST_Urbano!G7),\"\",CST_Urbano!G7)","v":""},null,"V"]
[]
["Dados Complementares do FCT"]
["Critério EOT",null,null,null,null,"EAC total",null,null,"Wh","AER",null,null,null,"km"]
[]
["Cálculos intermediários no regime de redução de carga"]
["n",{"$f":"SUMIF(S18:S71,\"n\",A18:A71)","v":0},"Zn",null,"RCDC:",null,null,null,"km","RCDA:",null,null,null,"km"]
[]
["Dados de emissão mássica, distâncias e balanço de carga do FCT estrada",null,null,null,null,null,null,null,null,null,null,null,null,null,"Verificação de EOT"]
{"$rows_left_out":57}
{"sheet":"Emissões 6.2.2.1 Estrada","index":6,"n_rows":70,"n_cols":14,"rows_kept":70,"cut":false,"hidden":false,"merged":[[0,1,0,13],[1,1,1,13],[2,1,2,13],[3,0,3,13],[4,0,4,1],[4,2,4,3],[4,4,4,5],[4,6,4,7],[8,1,8,9],[13,0,13,13],[5,0,5,1],[5,2,5,3],[5,4,5,5],[5,6,5,7],[6,0,6,1],[6,2,6,3],[6,4,6,5],[6,6,6,7]]}
[null,"Cálculos de veículos híbridos"]
[null,"Ensaios em redução de carga no ciclo estrada - Resultados conforme 6.2.2.1"]
[null,"    Versão 8"]
["Dados do veículo e do ensaio"]
["id do veículo",null,{"$f":"IF(ISBLANK(CST_Urbano!C5),\"\",CST_Urbano!C5)","v":""},null,"Capacidade do RESS",null,{"$f":"IF(ISBLANK(CST_Urbano!G5),\"\",CST_Urbano!G5)","v":""},null,"Ah"]
["nº do processo",null,{"$f":"IF(ISBLANK(CST_Urbano!C6),\"\",CST_Urbano!C6)","v":""},null,"Vsist1",null,{"$f":"IF(ISBLANK(CST_Urbano!G6),\"\",CST_Urbano!G6)","v":""},null,"V"]
["Combustível do ensaio",null,{"$f":"IF(ISBLANK(CST_Urbano!C7),\"\",CST_Urbano!C7)","v":""},null,"Vsist2",null,{"$f":"IF(ISBLANK(CST_Urbano!G7),\"\",CST_Urbano!G7)","v":""},null,"V"]
[]
[null,"Resultado das emissões e consumo energético conforme item 6.2.2.1"]
[null,"CO","HC","NOx","CO2","NMHC","ECCD","FCCD","ACequiv.","Consumotot."]
[null,"(g/km)","(g/km)","(g/km)","(g/km)","(g/km)","(Wh/km)","(l/100km)","(l/100km)","(l/100km)"]
[null,{"$f":"IFERROR((SUMIFS(FCT_Estrada_Dados!$B$18:$B$71,FCT_Estrada_Dados!$S$18:$S$71,\"CD\")+(1+FCT_Estrada_Dados!$D$13)*SUMIFS(FCT_Estrada_Dados!$B$18:$B$71,FCT_Estrada_Dados!$S$18:$S$71,\"n-1\"))/FCT_Estrada_Dados!$L$13,\"\")","v":""},{"$f":"IFERROR((SUMIFS(FCT_Estrada_Dados!$C$18:$C$71,FCT_Estrada_Dados!$S$18:$S$71,\"CD\")+(1+FCT_Estrada_Dados!$D$13)*SUMIFS(FCT_Estrada_Dados!$C$18:$C$71,FCT_Estrada_Dados!$S$18:$S$71,\"n-1\"))/FCT_Estrada_Dados!$L$13,\"\")","v":""},{"$f":"IFERROR((SUMIFS(FCT_Estrada_Dados!$D$18:$D$71,FCT_Estrada_Dados!$S$18:$S$71,\"CD\")+(1+FCT_Estrada_Dados!$D$13)*SUMIFS(FCT_Estrada_Dados!$D$18:$D$71,FCT_Estrada_Dados!$S$18:$S$71,\"n-1\"))/FCT_Estrada_Dados!$L$13,\"\")","v":""},{"$f":"IFERROR((SUMIFS(FCT_Estrada_Dados!$E$18:$E$71,FCT_Estrada_Dados!$S$18:$S$71,\"CD\")+(1+FCT_Estrada_Dados!$D$13)*SUMIFS(FCT_Estrada_Dados!$E$18:$E$71,FCT_Estrada_Dados!$S$18:$S$71,\"n-1\"))/FCT_Estrada_Dados!$L$13,\"\")","v":""},{"$f":"IFERROR((SUMIFS(FCT_Estrada_Dados!$G$18:$G$71,FCT_Estrada_Dados!$S$18:$S$71,\"CD\")+(1+FCT_Estrada_Dados!$D$13)*SUMIFS(FCT_Estrada_Dados!$G$18:$G$71,FCT_Estrada_Dados!$S$18:$S$71,\"n-1\"))/FCT_Estrada_Dados!$L$13,\"\")","v":""},{"$f":"IFERROR(FCT_Estrada_Dados!$G$10/FCT_Estrada_Dados!$L$13,\"\")","v":""},{"$f":"IFERROR(SUM(IF(FCT_Estrada_Dados!S18:S71=\"CD\",FCT_Estrada_Dados!H18:H71*FCT_Estrada_Dados!P18:P71,0)+(1+FCT_Estrada_Dados!D13)*IF(FCT_Estrada_Dados!S18:S71=\"n-1\",FCT_Estrada_Dados!H18:H71*FCT_Estrada_Dados!P18:P71,0))/FCT_Estrada_Dados!L13,\"\")","v":""},{"$f":"IFERROR(100*((G12*0.0036)/VLOOKUP(CST_Urbano!C7,Combustíveis,2,FALSE)),\"\")","v":""},{"$f":"IFERROR(H12+I12,\"\")","v":""}]
[]
["Resultado das emissões e consumo energético por ciclo"]
["Nº Ciclo","CO","HC","NOx","CO2","NMHC","ECDi","EDCi","DC/AC","Consumo_AC","Consumo_DC","AC equivalente","Consumo","Tipo de"]
{"$rows_left_out":56}
{"sheet":"Emissões 6.2.2.2 Estrada","index":7,"n_rows":70,"n_cols":14,"rows_kept":70,"cut":false,"hidden":false,"merged":[[0,1,0,13],[1,1,1,13],[2,1,2,13],[3,0,3,13],[4,0,4,1],[4,2,4,3],[4,4,4,5],[4,6,4,7],[8,1,8,9],[13,0,13,13],[5,0,5,1],[5,2,5,3],[5,4,5,5],[5,6,5,7],[6,0,6,1],[6,2,6,3],[6,4,6,5],[6,6,6,7]]}
[null,"Cálculos de veículos híbridos"]
[null,"Ensaios em redução de carga no ciclo estrada - Resultados conforme 6.2.2.2"]
[null,"    Versão 8"]
["Dados do veículo e do ensaio"]
["id do veículo",null,{"$f":"IF(ISBLANK(CST_Urbano!C5),\"\",CST_Urbano!C5)","v":""},null,"Capacidade do RESS",null,{"$f":"IF(ISBLANK(CST_Urbano!G5),\"\",CST_Urbano!G5)","v":""},null,"Ah"]
["nº do processo",null,{"$f":"IF(ISBLANK(CST_Urbano!C6),\"\",CST_Urbano!C6)","v":""},null,"Vsist1",null,{"$f":"IF(ISBLANK(CST_Urbano!G6),\"\",CST_Urbano!G6)","v":""},null,"V"]
["Combustível do ensaio",null,{"$f":"IF(ISBLANK(CST_Urbano!C7),\"\",CST_Urbano!C7)","v":""},null,"Vsist2",null,{"$f":"IF(ISBLANK(CST_Urbano!G7),\"\",CST_Urbano!G7)","v":""},null,"V"]
[]
[null,"Resultado das emissões e consumo energético conforme item 6.2.2.2"]
[null,"CO","HC","NOx","CO2","NMHC","ECCD","FCCD","ACequiv.","Consumotot."]
[null,"(g/km)","(g/km)","(g/km)","(g/km)","(g/km)","(Wh/km)","(l/100km)","(l/100km)","(l/100km)"]
[null,{"$f":"IF(COUNTIF($N$17:$N$70,\"Início EOT\")+COUNTIF($N$17:$N$70,\"CS1\")>0,SUMIF($N$17:$N$70,\"CD\",$B$17:$B$70)+SUMIF($N$17:$N$70,\"n-1\",$B$17:$B$70)+SUMIF($N$17:$N$70,\"n\",$B$17:$B$70)+SUMIF($N$17:$N$70,\"Transição\",$B$17:$B$70)+CST_Estrada!$B$17*(1-UTILITYFACTOR(FCT_Estrada_Dados!$G$13)),\"\")","v":""},{"$f":"IF(COUNTIF($N$17:$N$70,\"Início EOT\")+COUNTIF($N$17:$N$70,\"CS1\")>0,SUMIF($N$17:$N$70,\"CD\",$C$17:$C$70)+SUMIF($N$17:$N$70,\"n-1\",$C$17:$C$70)+SUMIF($N$17:$N$70,\"n\",$C$17:$C$70)+SUMIF($N$17:$N$70,\"Transição\",$C$17:$C$70)+CST_Estrada!$C$17*(1-UTILITYFACTOR(FCT_Estrada_Dados!$G$13)),\"\")","v":""},{"$f":"IF(COUNTIF($N$17:$N$70,\"Início EOT\")+COUNTIF($N$17:$N$70,\"CS1\")>0,SUMIF($N$17:$N$70,\"CD\",$D$17:$D$70)+SUMIF($N$17:$N$70,\"n-1\",$D$17:$D$70)+SUMIF($N$17:$N$70,\"n\",$D$17:$D$70)+SUMIF($N$17:$N$70,\"Transição\",$D$17:$D$70)+CST_Estrada!$D$17*(1-UTILITYFACTOR(FCT_Estrada_Dados!$G$13)),\"\")","v":""},{"$f":"IF(COUNTIF($N$17:$N$70,\"Início EOT\")+COUNTIF($N$17:$N$70,\"CS1\")>0,SUMIF($N$17:$N$70,\"CD\",$E$17:$E$70)+SUMIF($N$17:$N$70,\"n-1\",$E$17:$E$70)+SUMIF($N$17:$N$70,\"n\",$E$17:$E$70)+SUMIF($N$17:$N$70,\"Transição\",$E$17:$E$70)+CST_Estrada!$E$17*(1-UTILITYFACTOR(FCT_Estrada_Dados!$G$13)),\"\")","v":""},{"$f":"IF(COUNTIF($N$17:$N$70,\"Início EOT\")+COUNTIF($N$17:$N$70,\"CS1\")>0,SUMIF($N$17:$N$70,\"CD\",$F$17:$F$70)+SUMIF($N$17:$N$70,\"n-1\",$F$17:$F$70)+SUMIF($N$17:$N$70,\"n\",$F$17:$F$70)+SUMIF($N$17:$N$70,\"Transição\",$F$17:$F$70)+CST_Estrada!$G$17*(1-UTILITYFACTOR(FCT_Estrada_Dados!$G$13)),\"\")","v":""},{"$f":"IF(COUNTIF($N$17:$N$70,\"Início EOT\")+COUNTIF($N$17:$N$70,\"CS1\")>0,SUMIF($N$17:$N$70,\"CD\",$J$17:$J$70)+SUMIF($N$17:$N$70,\"n-1\",$J$17:$J$70)+SUMIF($N$17:$N$70,\"n\",$J$17:$J$70)+SUMIF($N$17:$N$70,\"Transição\",$J$17:$J$70),\"\")","v":""},{"$f":"IF(COUNTIF($N$17:$N$70,\"Início EOT\")+COUNTIF($N$17:$N$70,\"CS1\")>0,SUMIF($N$17:$N$70,\"CD\",$M$17:$M$70)+SUMIF($N$17:$N$70,\"n-1\",$M$17:$M$70)+SUMIF($N$17:$N$70,\"n\",$M$17:$M$70)+SUMIF($N$17:$N$70,\"Transição\",$M$17:$M$70)+CST_Estrada!$I$12*(1-UTILITYFACTOR(FCT_Estrada_Dados!$G$13)),\"\")","v":""},{"$f":"IFERROR(100*((G12*0.0036)/VLOOKUP(CST_Urbano!$C$7,Combustíveis,2,FALSE)),\"\")","v":""},{"$f":"IFERROR(H12+I12,\"\")","v":""}]
[]
["EMISSÕES E CONSUMOS PONDERADOS COM FATORES DE UTILIZAÇÃO PARA CADA CICLO"]
["Nº Ciclo","CO","HC","NOx","CO2","NMHC","ECDi","EDCi","UFi","Consumo_AC","Consumo_DC","AC equivalente","Consumo","Tipo de"]
{"$rows_left_out":56}
{"sheet":"Sumário & Médias","index":8,"n_rows":47,"n_cols":13,"rows_kept":47,"cut":false,"hidden":false,"merged":[[43,0,43,4],[46,0,46,4],[28,5,28,7],[31,0,31,4],[33,5,33,7],[35,0,35,4],[36,5,36,7],[39,0,39,4],[27,5,27,7],[8,5,8,12],[11,0,11,4],[12,0,12,4],[14,5,14,9],[17,0,17,4],[18,0,18,4],[20,5,20,10],[21,5,21,7],[21,8,21,10],[24,0,24,4],[25,0,25,4],[5,0,5,1],[5,2,5,3],[5,4,5,5],[5,6,5,7],[6,0,6,1],[6,2,6,3],[6,4,6,5],[6,6,6,7],[0,1,0,13],[1,1,1,13],[2,1,2,13],[3,0,3,8],[4,0,4,1],[4,2,4,3],[4,4,4,5],[4,6,4,7]]}
[null,"Cálculos de veículos híbridos"]
[null,"Sumário dos resultados e médias de emissões e consumos"]
[null,"    Versão 8"]
["Dados do veículo e do ensaio"]
["id do veículo",null,{"$f":"IF(ISBLANK(CST_Urbano!C5),\"\",CST_Urbano!C5)","v":""},null,"Capacidade do RESS",null,{"$f":"IF(ISBLANK(CST_Urbano!G5),\"\",CST_Urbano!G5)","v":""},null,"Ah"]
["nº do processo",null,{"$f":"IF(ISBLANK(CST_Urbano!C6),\"\",CST_Urbano!C6)","v":""},null,"Vsist1",null,{"$f":"IF(ISBLANK(CST_Urbano!G6),\"\",CST_Urbano!G6)","v":""},null,"V",null," "]
["Combustível do ensaio",null,{"$f":"IF(ISBLANK(CST_Urbano!C7),\"\",CST_Urbano!C7)","v":""},null,"Vsist2",null,{"$f":"IF(ISBLANK(CST_Urbano!G7),\"\",CST_Urbano!G7)","v":""},null,"V"]
[]
[null,null,null,null,null,"Resultado das emissões no ciclo urbano"]
[null,null,null,null,null,"CO","HC","NOx","CO2","NMHC","NMOG","Aldeídos","M.P."]
[null,null,null,null,null,"(g/km)","(g/km)","(g/km)","(g/km)","(g/km)","(g/km)","(g/km)","(g/km)"]
["CST (Energia líquida proveniente do combustível consumível) - YCST",null,null,null,null,{"$f":"IF(ISNUMBER(CST_Urbano!B18),CST_Urbano!B18,\"\")","v":""},{"$f":"IF(ISNUMBER(CST_Urbano!C18),CST_Urbano!C18,\"\")","v":""},{"$f":"IF(ISNUMBER(CST_Urbano!D18),CST_Urbano!D18,\"\")","v":""},{"$f":"IF(ISNUMBER(CST_Urbano!E18),CST_Urbano!E18,\"\")","v":""},{"$f":"IF(ISNUMBER(CST_Urbano!G18),CST_Urbano!G18,\"\")","v":""},{"$f":"IF(ISNUMBER(CST_Urbano!H18),CST_Urbano!H18,\"\")","v":""},{"$f":"IF(ISNUMBER(CST_Urbano!I18),CST_Urbano!I18,\"\")","v":""},{"$f":"IF(ISNUMBER(CST_Urbano!J18),CST_Urbano!J18,\"\")","v":""}]
["FCT Ponderado (YUFW) - \"Predominante Elétrico\"",null,null,null,null,{"$f":"IF(ISNUMBER('Emissões 6.2.2.2 Urbano'!B12),'Emissões 6.2.2.2 Urbano'!B12,\"\")","v":""},{"$f":"IF(ISNUMBER('Emissões 6.2.2.2 Urbano'!C12),'Emissões 6.2.2.2 Urbano'!C12,\"\")","v":""},{"$f":"IF(ISNUMBER('Emissões 6.2.2.2 Urbano'!D12),'Emissões 6.2.2.2 Urbano'!D12,\"\")","v":""},{"$f":"IF(ISNUMBER('Emissões 6.2.2.2 Urbano'!E12),'Emissões 6.2.2.2 Urbano'!E12,\"\")","v":""},{"$f":"IF(ISNUMBER('Emissões 6.2.2.2 Urbano'!F12),'Emissões 6.2.2.2 Urbano'!F12,\"\")","v":""}]
[]
[null,null,null,null,null,"Resultado das emissões no ciclo estrada"]
{"$rows_left_out":32}